{"text_format":"1","workbook":"xlsx","n_sheets":2,"sheets":["MATCH","Feuil1"],"not_rendered":{"charts":0,"images":2,"macros":1,"external_links":0,"defined_names":2,"comments":1,"pivot_tables":0},"unopened":[],"bounds":{"document_bytes":16777216,"sheet_cells":100000,"rows_first":2000,"rows_last":500,"rows_between":2000,"halvings":0,"cell_chars":16384,"cell_head_chars":4096},"cells_cut":0,"cells_raw":0,"read":"whole","date_system":"1900"}

{"sheet":"MATCH","index":0,"n_rows":529,"n_cols":46,"rows_kept":529,"cut":false,"hidden":false,"merged":[[19,12,19,15],[19,18,19,20],[0,0,0,21],[1,4,1,21],[2,6,2,15],[3,19,3,20],[18,12,18,15],[18,18,18,21]]}
["TOURNOI INTERNATIONAL DE FRANCE - SOUVENIR DENIS RANDON 2015"]
[null,null,null,null,"13ème Edition     Clermont l'Hérault           Samedi 24 octobre"]
[null,null,null,null,null,null,"COUPE BERNARD GARCIA"]
["SEXE","Tir","REG.","Place","NOMS","Prénoms","Clubs","AN","POIDS",1,2,3,"ARR",1,2,3,"EP-J","Total","IWF","Class",null,"Catég","Points","DEP +","REG +","IRG +","FED +","NAT +","INTB +","INTA +","OLY +","NCL"]
[null,null,null,null,"Filles"]
["F",null,null,null,"ROMERO","Héloïse","Narbonne Haltéro",2000,51.75,40,43,45,{"$f":"IF(I6=\"\",\"\",IF(MAXA(J6:L6)<=0,0,MAXA(J6:L6)))","v":45},50,55,-58,{"$f":"IF(I6=\"\",\"\",IF(MAXA(N6:P6)<=0,0,MAXA(N6:P6)))","v":55},{"$f":"IF(I6=\"\",\"\",IF(OR(M6=0,Q6=0),0,M6+Q6))","v":100},{"$f":"IF(I6=\"\",\"\",IF(A6=\"H\",10^(0.794358141*LOG(I6/174.393)^2)*R6,IF(A6=\"F\",10^(0.89726074*LOG(I6/148.026)^2)*R6,\"\")))","v":153.78816668201492},{"$f":"RANK(S6,S6:S9)","v":3},{"$f":"IF(I6=\"\",\"\",IF(AE6>=0,AE6,IF(AD6>=0,AD6,IF(AC6>=0,AC6,IF(AB6>=0,AB6,IF(AA6>=0,AA6,IF(Z6>=0,Z6,IF(Y6>=0,Y6,X6))))))))","v":{"$error":"#N/A"}},null,{"$f":"SUM(R6-I6)","v":48.25},{"$f":"R6-HLOOKUP(V6,Feuil1!$C$1:$AU$9,2,FALSE)","v":{"$error":"#N/A"}},{"$f":"R6-HLOOKUP(V6,Feuil1!$C$1:$AU$9,3,FALSE)","v":{"$error":"#N/A"}},{"$f":"R6-HLOOKUP(V6,Feuil1!$C$1:$AU$9,4,FALSE)","v":{"$error":"#N/A"}},{"$f":"R6-HLOOKUP(V6,Feuil1!$C$1:$AU$9,5,FALSE)","v":{"$error":"#N/A"}},{"$f":"R6-HLOOKUP(V6,Feuil1!$C$1:$AU$9,6,FALSE)","v":{"$error":"#N/A"}},{"$f":"R6-HLOOKUP(V6,Feuil1!$C$1:$AU$9,7,FALSE)","v":{"$error":"#N/A"}},{"$f":"R6-HLOOKUP(V6,Feuil1!$C$1:$AU$9,8,FALSE)","v":{"$error":"#N/A"}},{"$f":"R6-HLOOKUP(V6,Feuil1!$C$1:$AU$9,9,FALSE)","v":{"$error":"#N/A"}},null,null,null,null,null,null,null,{"$f":"IF(AE6>=0,$AE$4,IF(AD6>=0,$AD$4,IF(AC6>=0,$AC$4,IF(AB6>=0,$AB$4,IF(AA6>=0,$AA$4,IF(Z6>=0,$Z$4,IF(Y6>=0,$Y$4,IF(X6>=0,$X$4,$AF$4))))))))","v":{"$error":"#N/A"}}]
["F",null,null,null,"CHRISTOPHEL","Marie","ASPTT Strabourg",2000,47,44,-47,47,{"$f":"IF(I7=\"\",\"\",IF(MAXA(J7:L7)<=0,0,MAXA(J7:L7)))","v":47},54,57,60,{"$f":"IF(I7=\"\",\"\",IF(MAXA(N7:P7)<=0,0,MAXA(N7:P7)))","v":60},{"$f":"IF(I7=\"\",\"\",IF(OR(M7=0,Q7=0),0,M7+Q7))","v":107},{"$f":"IF(I7=\"\",\"\",IF(A7=\"H\",10^(0.794358141*LOG(I7/174.393)^2)*R7,IF(A7=\"F\",10^(0.89726074*LOG(I7/148.026)^2)*R7,\"\")))","v":178.6992350481359},{"$f":"RANK(S7,S6:S9)","v":2},{"$f":"IF(I7=\"\",\"\",IF(AE7>=0,AE7,IF(AD7>=0,AD7,IF(AC7>=0,AC7,IF(AB7>=0,AB7,IF(AA7>=0,AA7,IF(Z7>=0,Z7,IF(Y7>=0,Y7,X7))))))))","v":{"$error":"#N/A"}},null,{"$f":"SUM(R7-I7)","v":60},{"$f":"R7-HLOOKUP(V7,Feuil1!$C$1:$AU$9,2,FALSE)","v":{"$error":"#N/A"}},{"$f":"R7-HLOOKUP(V7,Feuil1!$C$1:$AU$9,3,FALSE)","v":{"$error":"#N/A"}},{"$f":"R7-HLOOKUP(V7,Feuil1!$C$1:$AU$9,4,FALSE)","v":{"$error":"#N/A"}},{"$f":"R7-HLOOKUP(V7,Feuil1!$C$1:$AU$9,5,FALSE)","v":{"$error":"#N/A"}},{"$f":"R7-HLOOKUP(V7,Feuil1!$C$1:$AU$9,6,FALSE)","v":{"$error":"#N/A"}},{"$f":"R7-HLOOKUP(V7,Feuil1!$C$1:$AU$9,7,FALSE)","v":{"$error":"#N/A"}},{"$f":"R7-HLOOKUP(V7,Feuil1!$C$1:$AU$9,8,FALSE)","v":{"$error":"#N/A"}},{"$f":"R7-HLOOKUP(V7,Feuil1!$C$1:$AU$9,9,FALSE)","v":{"$error":"#N/A"}},null,null,null,null,null,null,null,{"$f":"IF(AE7>=0,$AE$4,IF(AD7>=0,$AD$4,IF(AC7>=0,$AC$4,IF(AB7>=0,$AB$4,IF(AA7>=0,$AA$4,IF(Z7>=0,$Z$4,IF(Y7>=0,$Y$4,IF(X7>=0,$X$4,$AF$4))))))))","v":{"$error":"#N/A"}}]
["F",null,null,null,"OTT","Justine","SHC Haguenau",1998,64.849999999999994,59,62,-65,{"$f":"IF(I8=\"\",\"\",IF(MAXA(J8:L8)<=0,0,MAXA(J8:L8)))","v":62},78,81,83,{"$f":"IF(I8=\"\",\"\",IF(MAXA(N8:P8)<=0,0,MAXA(N8:P8)))","v":83},{"$f":"IF(I8=\"\",\"\",IF(OR(M8=0,Q8=0),0,M8+Q8))","v":145},{"$f":"IF(I8=\"\",\"\",IF(A8=\"H\",10^(0.794358141*LOG(I8/174.393)^2)*R8,IF(A8=\"F\",10^(0.89726074*LOG(I8/148.026)^2)*R8,\"\")))","v":189.07742137572234},{"$f":"RANK(S8,S6:S9)","v":1},{"$f":"IF(I8=\"\",\"\",IF(AE8>=0,AE8,IF(AD8>=0,AD8,IF(AC8>=0,AC8,IF(AB8>=0,AB8,IF(AA8>=0,AA8,IF(Z8>=0,Z8,IF(Y8>=0,Y8,X8))))))))","v":0},null,null,null,null,null,null,null,null,null,null,null,null,null,null,null,null,null,null,null,1]
["F",null,null,null,"PEIGUET","Clara","Clermont Sports",2007,28.15,16,18,20,{"$f":"IF(I9=\"\",\"\",IF(MAXA(J9:L9)<=0,0,MAXA(J9:L9)))","v":20},26,28,30,{"$f":"IF(I9=\"\",\"\",IF(MAXA(N9:P9)<=0,0,MAXA(N9:P9)))","v":30},{"$f":"IF(I9=\"\",\"\",IF(OR(M9=0,Q9=0),0,M9+Q9))","v":50},{"$f":"IF(I9=\"\",\"\",IF(A9=\"H\",10^(0.794358141*LOG(I9/174.393)^2)*R9,IF(A9=\"F\",10^(0.89726074*LOG(I9/148.026)^2)*R9,\"\")))","v":146.29224061573316},{"$f":"RANK(S9,S6:S9)","v":4},{"$f":"IF(I9=\"\",\"\",IF(AE9>=0,AE9,IF(AD9>=0,AD9,IF(AC9>=0,AC9,IF(AB9>=0,AB9,IF(AA9>=0,AA9,IF(Z9>=0,Z9,IF(Y9>=0,Y9,X9))))))))","v":0},null,null,null,null,null,null,null,null,null,null,null,null,null,null,null,null,null,null,null,1]
[null,null,null,null,"Garçons"]
["H",null,null,null,"BENOIT","Johann","EEAR Monteux",1998,91.95,95,-100,-100,{"$f":"IF(I11=\"\",\"\",IF(MAXA(J11:L11)<=0,0,MAXA(J11:L11)))","v":95},-113,115,-120,{"$f":"IF(I11=\"\",\"\",IF(MAXA(N11:P11)<=0,0,MAXA(N11:P11)))","v":115},{"$f":"IF(I11=\"\",\"\",IF(OR(M11=0,Q11=0),0,M11+Q11))","v":210},{"$f":"IF(I11=\"\",\"\",IF(A11=\"H\",10^(0.794358141*LOG(I11/174.393)^2)*R11,IF(A11=\"F\",10^(0.89726074*LOG(I11/148.026)^2)*R11,\"\")))","v":241.8802732987134},{"$f":"RANK(S11,S11:S16)","v":5},{"$f":"IF(I11=\"\",\"\",IF(AE11>=0,AE11,IF(AD11>=0,AD11,IF(AC11>=0,AC11,IF(AB11>=0,AB11,IF(AA11>=0,AA11,IF(Z11>=0,Z11,IF(Y11>=0,Y11,X11))))))))","v":{"$error":"#N/A"}},null,{"$f":"SUM(R11-(I11*2))","v":26.099999999999994},{"$f":"R11-HLOOKUP(V11,Feuil1!$C$1:$AU$9,2,FALSE)","v":{"$error":"#N/A"}},{"$f":"R11-HLOOKUP(V11,Feuil1!$C$1:$AU$9,3,FALSE)","v":{"$error":"#N/A"}},{"$f":"R11-HLOOKUP(V11,Feuil1!$C$1:$AU$9,4,FALSE)","v":{"$error":"#N/A"}},{"$f":"R11-HLOOKUP(V11,Feuil1!$C$1:$AU$9,5,FALSE)","v":{"$error":"#N/A"}},{"$f":"R11-HLOOKUP(V11,Feuil1!$C$1:$AU$9,6,FALSE)","v":{"$error":"#N/A"}},{"$f":"R11-HLOOKUP(V11,Feuil1!$C$1:$AU$9,7,FALSE)","v":{"$error":"#N/A"}},{"$f":"R11-HLOOKUP(V11,Feuil1!$C$1:$AU$9,8,FALSE)","v":{"$error":"#N/A"}},{"$f":"R11-HLOOKUP(V11,Feuil1!$C$1:$AU$9,9,FALSE)","v":{"$error":"#N/A"}},null,null,null,null,null,null,null,{"$f":"IF(AE11>=0,$AE$4,IF(AD11>=0,$AD$4,IF(AC11>=0,$AC$4,IF(AB11>=0,$AB$4,IF(AA11>=0,$AA$4,IF(Z11>=0,$Z$4,IF(Y11>=0,$Y$4,IF(X11>=0,$X$4,$AF$4))))))))","v":{"$error":"#N/A"}}]
["H",null,null,null,"SERGENT ","Enzo","Clermont Sports",2001,61.55,72,75,78,78,95,-100,100,100,178,258.77764829484795,{"$f":"RANK(S12,S11:S16)","v":3},{"$error":"#N/A"},null,{"$f":"SUM(R12-I12)","v":116.45},{"$f":"R12-HLOOKUP(V12,Feuil1!$C$1:$AU$9,2,FALSE)","v":{"$error":"#N/A"}},{"$f":"R12-HLOOKUP(V12,Feuil1!$C$1:$AU$9,3,FALSE)","v":{"$error":"#N/A"}},{"$f":"R12-HLOOKUP(V12,Feuil1!$C$1:$AU$9,4,FALSE)","v":{"$error":"#N/A"}},{"$f":"R12-HLOOKUP(V12,Feuil1!$C$1:$AU$9,5,FALSE)","v":{"$error":"#N/A"}},{"$f":"R12-HLOOKUP(V12,Feuil1!$C$1:$AU$9,6,FALSE)","v":{"$error":"#N/A"}},{"$f":"R12-HLOOKUP(V12,Feuil1!$C$1:$AU$9,7,FALSE)","v":{"$error":"#N/A"}},{"$f":"R12-HLOOKUP(V12,Feuil1!$C$1:$AU$9,8,FALSE)","v":{"$error":"#N/A"}},{"$f":"R12-HLOOKUP(V12,Feuil1!$C$1:$AU$9,9,FALSE)","v":{"$error":"#N/A"}},null,null,null,null,null,null,null,{"$error":"#N/A"}]
["H",null,null,null,"CANCE","Quentin","Figeac",2002,58.8,50,53,57,{"$f":"IF(I13=\"\",\"\",IF(MAXA(J13:L13)<=0,0,MAXA(J13:L13)))","v":57},67,-72,72,{"$f":"IF(I13=\"\",\"\",IF(MAXA(N13:P13)<=0,0,MAXA(N13:P13)))","v":72},{"$f":"IF(I13=\"\",\"\",IF(OR(M13=0,Q13=0),0,M13+Q13))","v":129},{"$f":"IF(I13=\"\",\"\",IF(A13=\"H\",10^(0.794358141*LOG(I13/174.393)^2)*R13,IF(A13=\"F\",10^(0.89726074*LOG(I13/148.026)^2)*R13,\"\")))","v":193.94285546362943},{"$f":"RANK(S13,S11:S16)","v":6},{"$f":"IF(I13=\"\",\"\",IF(AE13>=0,AE13,IF(AD13>=0,AD13,IF(AC13>=0,AC13,IF(AB13>=0,AB13,IF(AA13>=0,AA13,IF(Z13>=0,Z13,IF(Y13>=0,Y13,X13))))))))","v":{"$error":"#N/A"}},null,{"$f":"SUM(R13-(I13*2))","v":11.400000000000006},{"$f":"R13-HLOOKUP(V13,Feuil1!$C$1:$AU$9,2,FALSE)","v":{"$error":"#N/A"}},{"$f":"R13-HLOOKUP(V13,Feuil1!$C$1:$AU$9,3,FALSE)","v":{"$error":"#N/A"}},{"$f":"R13-HLOOKUP(V13,Feuil1!$C$1:$AU$9,4,FALSE)","v":{"$error":"#N/A"}},{"$f":"R13-HLOOKUP(V13,Feuil1!$C$1:$AU$9,5,FALSE)","v":{"$error":"#N/A"}},{"$f":"R13-HLOOKUP(V13,Feuil1!$C$1:$AU$9,6,FALSE)","v":{"$error":"#N/A"}},{"$f":"R13-HLOOKUP(V13,Feuil1!$C$1:$AU$9,7,FALSE)","v":{"$error":"#N/A"}},{"$f":"R13-HLOOKUP(V13,Feuil1!$C$1:$AU$9,8,FALSE)","v":{"$error":"#N/A"}},{"$f":"R13-HLOOKUP(V13,Feuil1!$C$1:$AU$9,9,FALSE)","v":{"$error":"#N/A"}},null,null,null,null,null,null,null,{"$f":"IF(AE13>=0,$AE$4,IF(AD13>=0,$AD$4,IF(AC13>=0,$AC$4,IF(AB13>=0,$AB$4,IF(AA13>=0,$AA$4,IF(Z13>=0,$Z$4,IF(Y13>=0,$Y$4,IF(X13>=0,$X$4,$AF$4))))))))","v":{"$error":"#N/A"}}]
["H",null,null,null,"GARCIA","Florian","Clermont Sports",1997,81.5,75,80,85,{"$f":"IF(I14=\"\",\"\",IF(MAXA(J14:L14)<=0,0,MAXA(J14:L14)))","v":85},110,115,120,{"$f":"IF(I14=\"\",\"\",IF(MAXA(N14:P14)<=0,0,MAXA(N14:P14)))","v":120},{"$f":"IF(I14=\"\",\"\",IF(OR(M14=0,Q14=0),0,M14+Q14))","v":205},{"$f":"IF(I14=\"\",\"\",IF(A14=\"H\",10^(0.794358141*LOG(I14/174.393)^2)*R14,IF(A14=\"F\",10^(0.89726074*LOG(I14/148.026)^2)*R14,\"\")))","v":250.29623066554453},{"$f":"RANK(S14,S11:S16)","v":4},{"$f":"IF(I14=\"\",\"\",IF(AE14>=0,AE14,IF(AD14>=0,AD14,IF(AC14>=0,AC14,IF(AB14>=0,AB14,IF(AA14>=0,AA14,IF(Z14>=0,Z14,IF(Y14>=0,Y14,X14))))))))","v":{"$error":"#N/A"}},null,{"$f":"SUM(R14-(I14*2))","v":42},{"$f":"R14-HLOOKUP(V14,Feuil1!$C$1:$AU$9,2,FALSE)","v":{"$error":"#N/A"}},{"$f":"R14-HLOOKUP(V14,Feuil1!$C$1:$AU$9,3,FALSE)","v":{"$error":"#N/A"}},{"$f":"R14-HLOOKUP(V14,Feuil1!$C$1:$AU$9,4,FALSE)","v":{"$error":"#N/A"}},{"$f":"R14-HLOOKUP(V14,Feuil1!$C$1:$AU$9,5,FALSE)","v":{"$error":"#N/A"}},{"$f":"R14-HLOOKUP(V14,Feuil1!$C$1:$AU$9,6,FALSE)","v":{"$error":"#N/A"}},{"$f":"R14-HLOOKUP(V14,Feuil1!$C$1:$AU$9,7,FALSE)","v":{"$error":"#N/A"}},{"$f":"R14-HLOOKUP(V14,Feuil1!$C$1:$AU$9,8,FALSE)","v":{"$error":"#N/A"}},{"$f":"R14-HLOOKUP(V14,Feuil1!$C$1:$AU$9,9,FALSE)","v":{"$error":"#N/A"}},null,null,null,null,null,null,null,{"$f":"IF(AE14>=0,$AE$4,IF(AD14>=0,$AD$4,IF(AC14>=0,$AC$4,IF(AB14>=0,$AB$4,IF(AA14>=0,$AA$4,IF(Z14>=0,$Z$4,IF(Y14>=0,$Y$4,IF(X14>=0,$X$4,$AF$4))))))))","v":{"$error":"#N/A"}}]
["H",null,null,null,"MULLOR","Julien","Clermont Sports",1997,62.15,82,87,-90,87,105,-110,-110,105,192,277.20091835566484,{"$f":"RANK(S15,S11:S16)","v":2},{"$error":"#N/A"},null,{"$f":"SUM(R15-(I15*2))","v":67.7},{"$f":"R15-HLOOKUP(V15,Feuil1!$C$1:$AU$9,2,FALSE)","v":{"$error":"#N/A"}},{"$f":"R15-HLOOKUP(V15,Feuil1!$C$1:$AU$9,3,FALSE)","v":{"$error":"#N/A"}},{"$f":"R15-HLOOKUP(V15,Feuil1!$C$1:$AU$9,4,FALSE)","v":{"$error":"#N/A"}},{"$f":"R15-HLOOKUP(V15,Feuil1!$C$1:$AU$9,5,FALSE)","v":{"$error":"#N/A"}},{"$f":"R15-HLOOKUP(V15,Feuil1!$C$1:$AU$9,6,FALSE)","v":{"$error":"#N/A"}},{"$f":"R15-HLOOKUP(V15,Feuil1!$C$1:$AU$9,7,FALSE)","v":{"$error":"#N/A"}},{"$f":"R15-HLOOKUP(V15,Feuil1!$C$1:$AU$9,8,FALSE)","v":{"$error":"#N/A"}},{"$f":"R15-HLOOKUP(V15,Feuil1!$C$1:$AU$9,9,FALSE)","v":{"$error":"#N/A"}},null,null,null,null,null,null,null,{"$error":"#N/A"}]
["H",null,null,null,"YILDIRIM","Mario","SR Obernai",1998,71.8,90,95,98,98,112,116,120,120,218,286.05387663243908,{"$f":"RANK(S16,S11:S16)","v":1},{"$error":"#N/A"},null,{"$f":"SUM(R16-(I16*2))","v":74.400000000000006},{"$f":"R16-HLOOKUP(V16,Feuil1!$C$1:$AU$9,2,FALSE)","v":{"$error":"#N/A"}},{"$f":"R16-HLOOKUP(V16,Feuil1!$C$1:$AU$9,3,FALSE)","v":{"$error":"#N/A"}},{"$f":"R16-HLOOKUP(V16,Feuil1!$C$1:$AU$9,4,FALSE)","v":{"$error":"#N/A"}},{"$f":"R16-HLOOKUP(V16,Feuil1!$C$1:$AU$9,5,FALSE)","v":{"$error":"#N/A"}},{"$f":"R16-HLOOKUP(V16,Feuil1!$C$1:$AU$9,6,FALSE)","v":{"$error":"#N/A"}},{"$f":"R16-HLOOKUP(V16,Feuil1!$C$1:$AU$9,7,FALSE)","v":{"$error":"#N/A"}},{"$f":"R16-HLOOKUP(V16,Feuil1!$C$1:$AU$9,8,FALSE)","v":{"$error":"#N/A"}},{"$f":"R16-HLOOKUP(V16,Feuil1!$C$1:$AU$9,9,FALSE)","v":{"$error":"#N/A"}},null,null,null,null,null,null,null,{"$error":"#N/A"}]
[null,null,null,null,null,null,null,null,null,null,null," "]
[null,null,null,null,"Secrétaire de Compétition",null,"Arbitre",null,null,null,null,null,null,"Arbitre",null," ",null,null,null,"Arbitre"]
[null,null,null,"Nom :","Philippe AUBOUY","Nom :","WILZEWSKI Gerard",null,null,null,null,"Nom :","ARQUIER Beatrice",null,null,null,null,"Nom :","DELPUECH Jean-Claude"]
[null,null,null,"Signature :"," ","Signature :",null,null," ",null,null,"Signature :"," ",null,null,null,null,"Signature :"]
[]
[null,null,null,null,null,null,null,null,null,null," "," "]
[]
[]
[]
[]
[]
[]
[]
[]
[]
[]
[]
[]
[]
[]
[]
[]
[]
[]
[]
[]
[]
[]
[]
[]
[]
[]
[]
[]
[]
[]
[]
[]
[]
[]
[]
[]
[]
[]
[]
[]
[]
[]
[]
[]
[]
[]
[]
[]
[]
[]
[]
[]
[]
[]
[]
[]
[]
[]
[]
[]
[]
[]
[]
[]
[]
[]
[]
[]
[]
[]
[]
[]
[]
[]
[]
[]
[]
[]
[]
[]
[]
[]
[]
[]
[]
[]
[]
[]
[]
[]
[]
[]
[]
[]
[]
[]
[]
[]
[]
[]
[]
[]
[]
[]
[]
[]
[]
[]
[]
[]
[]
[]
[]
[]
[]
[]
[]
[]
[]
[]
[]
[]
[]
[]
[]
[]
[]
[]
[]
[]
[]
[]
[]
[]
[]
[]
[]
[]
[]
[]
[]
[]
[]
[]
[]
[]
[]
[]
[]
[]
[]
[]
[]
[]
[]
[]
[]
[]
[]
[]
[]
[]
[]
[]
[]
[]
[]
[]
[]
[]
[]
[]
[]
[]
[]
[]
[]
[]
[]
[]
[]
[]
[]
[]
[]
[]
[]
[]
[]
[]
[]
[]
[]
[]
[]
[]
[]
[]
[]
[]
[]
[]
[]
[]
[]
[]
[]
[]
[]
[]
[]
[]
[]
[]
[]
[]
[]
[]
[]
[]
[]
[]
[]
[]
[]
[]
[]
[]
[]
[]
[]
[]
[]
[]
[]
[]
[]
[]
[]
[]
[]
[]
[]
[]
[]
[]
[]
[]
[]
[]
[]
[]
[]
[]
[]
[]
[]
[]
[]
[]
[]
[]
[]
[]
[]
[]
[]
[]
[]
[]
[]
[]
[]
[]
[]
[]
[]
[]
[]
[]
[]
[]
[]
[]
[]
[]
[]
[]
[]
[]
[]
[]
[]
[]
[]
[]
[]
[]
[]
[]
[]
[]
[]
[]
[]
[]
[]
[]
[]
[]
[]
[]
[]
[]
[]
[]
[]
[]
[]
[]
[]
[]
[]
[]
[]
[]
[]
[]
[]
[]
[]
[]
[]
[]
[]
[]
[]
[]
[]
[]
[]
[]
[]
[]
[]
[]
[]
[]
[]
[]
[]
[]
[]
[]
[]
[]
[]
[]
[]
[]
[]
[]
[]
[]
[]
[]
[]
[]
[]
[]
[]
[]
[]
[]
[]
[]
[]
[]
{"$rows_left_out":130}
{"sheet":"Feuil1","index":1,"n_rows":28,"n_cols":47,"rows_kept":28,"cut":false,"hidden":true,"merged":[]}
[null,null,"FC44","FC48","FC53","FC58","FC63","FC69","FC+69","FJ48","FJ53","FJ58","FJ63","FJ69","FJ75","FJ+75","FS48","FS53","FS58","FS63","FS69","FS75","FS+75","C50","C56","C62","C69","C77","C85","C94","C+94","J56","J62","J69","J77","J85","J94","J105","J+105","S56","S62","S69","S77","S85","S94","S105","S+105"]
[null,"DEPARTEMENTAL",40,45,50,55,60,65,75,50,55,65,70,75,90,100,60,70,80,85,95,100,110,65,80,100,115,125,135,150,160,95,110,125,140,155,165,175,185,110,130,145,160,175,185,195,205]
[null,"REGIONAL",50,55,65,70,75,80,90,60,65,75,80,85,100,110,70,80,90,95,105,115,125,80,95,115,130,145,155,170,180,110,130,145,160,175,185,195,205,130,150,165,180,195,205,215,225]
[null,"INTERREGIONAL",60,65,75,80,85,95,105,75,80,90,95,100,115,120,85,95,100,110,120,130,140,95,110,130,150,165,180,190,205,130,150,165,185,195,205,215,225,145,170,185,205,220,230,240,250]
[null,"FEDERAL",70,75,85,90,95,105,115,85,95,100,110,120,130,140,95,105,115,125,135,145,155,110,125,145,160,180,195,210,220,145,165,185,205,220,230,240,250,170,195,215,235,250,260,270,280]
[null,"NATIONAL",80,85,95,100,110,120,130,95,105,110,125,135,145,155,110,120,130,140,150,160,170,120,140,160,175,195,215,225,235,170,190,215,235,250,260,270,280,195,220,240,265,280,290,300,310]
[null,"INTERNATIONAL B",90,95,105,115,125,135,145,110,120,130,140,150,160,170,125,140,155,165,175,180,190,135,155,175,190,210,230,240,250,190,215,240,270,280,290,305,315,210,240,260,290,310,320,330,340]
[null,"INTERNATIONAL A",100,105,115,125,135,145,155,125,135,145,155,165,175,185,140,160,175,185,190,195,210,150,175,195,215,235,250,260,270,215,235,260,280,300,310,320,330,225,255,275,310,330,340,350,360]
[null,"OLYMPIQUE",1000,1000,1000,1000,1000,1000,1000,1000,1000,1000,1000,1000,1000,10000,155,175,190,200,205,210,225,1000,1000,1000,1000,1000,10000,1000,1000,1000,1000,1000,10000,1000,1000,1000,10000,240,270,290,325,345,355,365,375]
[null,"MINIME","CADET","JUNIOR","SENIOR",null,"MINIME","CADETTE","JUNIOR","SENIOR"]
[20.010000000000002,"NON","C50","J56","S56",20.010000000000002,"NON","FC44","FJ48","FS48"]
[34.01,"NON","C50","J56","S56",30.01,"NON","FC44","FJ48","FS48"]
[38.01,"NON","C50","J56","S56",35.01,"NON","FC44","FJ48","FS48"]
[40.01,"NON","C50","J56","S56",36.01,"NON","FC44","FJ48","FS48"]
[45.01,"NON","C50","J56","S56",40.01,"NON","FC44","FJ48","FS48"]
[50.01,"NON","C56","J56","S56",44.01,"NON","FC48","FJ48","FS48"]
[52.05,"NON","C56","J56","S56",48.01,"NON","FC53","FJ53","FS53"]
[56.01,"NON","C62","J62","S62",53.01,"NON","FC58","FJ58","FS58"]
[62.01,"NON","C69","J69","S69",58.01,"NON","FC63","FJ63","FS63"]
[69.010000000000005,"NON","C77","J77","S77",63.01,"NON","FC69","FJ69","FS69"]
[77.010000000000005,"NON","C85","J85","S85",69.010000000000005,"NON","FC+69","FJ75","FS75"]
[85.01,"NON","C94","J94","S94",75.010000000000005,"NON","FC+69","FJ+75","FS+75"]
[94.01,"NON","C+94","J105","S105",110,"NON","FC+69","FJ+75","FS+75"]
[105.01,"NON","C+94","J+105","S+105",140,"NON","FC+69","FJ+75","FS+75"]
[110,"NON","C+94","J+105","S+105"]
[120,"NON","C+94","J+105","S+105"]
[130,"NON","C+94","J+105","S+105"]
[140,"NON","C+94","J+105","S+105"]