{"text_format":"1","workbook":"xlsx","n_sheets":3,"sheets":["MATCH","Feuil1","Feuil2"],"not_rendered":{"charts":0,"images":2,"macros":1,"external_links":0,"defined_names":2,"comments":1,"pivot_tables":0},"unopened":[],"bounds":{"document_bytes":16777216,"sheet_cells":100000,"rows_first":2000,"rows_last":500,"rows_between":2000,"halvings":0,"cell_chars":16384,"cell_head_chars":4096},"cells_cut":0,"cells_raw":0,"read":"whole","date_system":"1900"}

{"sheet":"MATCH","index":0,"n_rows":526,"n_cols":46,"rows_kept":526,"cut":false,"hidden":false,"merged":[[15,12,15,15],[15,18,15,20],[0,0,0,21],[1,4,1,21],[2,9,2,12],[3,19,3,20],[14,12,14,15],[14,18,14,21]]}
["TOURNOI INTERNATIONAL DE FRANCE - SOUVENIR DENIS RANDON 2016"]
[null,null,null,null,"14ème Edition      Clermont l'Hérault           Samedi 5 Novembre"]
[]
["SEXE","Tir","REG.","Place","NOMS","Prénoms","Nationalité","AN","POIDS",1,2,3,"ARR",1,2,3,"EP-J","Total","IWF","Class",null,"Catég","Points","DEP +","REG +","IRG +","FED +","NAT +","INTB +","INTA +","OLY +","NCL"]
[null,null,null,null,"FEMMES"]
["F",null,null,null,"LORENTZ","Manon","Obernai",91,50.25,65,68,71,{"$f":"IF(I6=\"\",\"\",IF(MAXA(J6:L6)<=0,0,MAXA(J6:L6)))","v":71},80,83,86,{"$f":"IF(I6=\"\",\"\",IF(MAXA(N6:P6)<=0,0,MAXA(N6:P6)))","v":86},{"$f":"IF(I6=\"\",\"\",IF(OR(M6=0,Q6=0),0,M6+Q6))","v":157},{"$f":"IF(I6=\"\",\"\",IF(A6=\"H\",10^(0.794358141*LOG(I6/174.393)^2)*R6,IF(A6=\"F\",10^(0.89726074*LOG(I6/148.026)^2)*R6,\"\")))","v":247.41841218228052},{"$f":"RANK(S6,S6:S12)","v":1},null,{"$f":"IF(I6=\"\",\"\",IF(A6=\"H\",IF(OR(H6=\"SEN\",H6<94),VLOOKUP(I6,Feuil1!$A$10:$E$28,5),IF(AND(H6>93,H6<97),VLOOKUP(I6,Feuil1!$A$10:$E$28,4),IF(AND(H6>93,H6<96),VLOOKUP(I6,Feuil1!$A$10:$E$28,3),IF(AND(H6>95,H6<2000),VLOOKUP(I6,Feuil1!$A$10:$E$28,3),VLOOKUP(I6,Feuil1!$A$10:$E$28,2))))),IF(OR(H6=\"SEN\",H6<94),VLOOKUP(I6,Feuil1!$F$10:$J$24,5),IF(AND(H6>93,H6<97),VLOOKUP(I6,Feuil1!$F$10:$J$24,4),IF(AND(H6>93,H6<96),VLOOKUP(I6,Feuil1!$F$10:$J$24,4),IF(AND(H6>93,H6<2000),VLOOKUP(I6,Feuil1!$F$10:$J$24,3),VLOOKUP(I6,Feuil1!$F$10:$J$24,2)))))))","v":"FS53"},null,{"$f":"R6-HLOOKUP(#REF!,Feuil1!$C$1:$AU$9,2,FALSE)","v":{"$error":"#REF!"}},{"$f":"R6-HLOOKUP(#REF!,Feuil1!$C$1:$AU$9,3,FALSE)","v":{"$error":"#REF!"}},{"$f":"R6-HLOOKUP(#REF!,Feuil1!$C$1:$AU$9,4,FALSE)","v":{"$error":"#REF!"}},{"$f":"R6-HLOOKUP(#REF!,Feuil1!$C$1:$AU$9,5,FALSE)","v":{"$error":"#REF!"}},{"$f":"R6-HLOOKUP(#REF!,Feuil1!$C$1:$AU$9,6,FALSE)","v":{"$error":"#REF!"}},{"$f":"R6-HLOOKUP(#REF!,Feuil1!$C$1:$AU$9,7,FALSE)","v":{"$error":"#REF!"}},{"$f":"R6-HLOOKUP(#REF!,Feuil1!$C$1:$AU$9,8,FALSE)","v":{"$error":"#REF!"}},{"$f":"R6-HLOOKUP(#REF!,Feuil1!$C$1:$AU$9,9,FALSE)","v":{"$error":"#REF!"}},null,null,null,null,null,null,null,{"$f":"IF(AE6>=0,$AE$4,IF(AD6>=0,$AD$4,IF(AC6>=0,$AC$4,IF(AB6>=0,$AB$4,IF(AA6>=0,$AA$4,IF(Z6>=0,$Z$4,IF(Y6>=0,$Y$4,IF(X6>=0,$X$4,$AF$4))))))))","v":{"$error":"#REF!"}}]
["F",null,null,null,"VIGNALI","Véronica","Italie",98,64.3,50,-54,-55,{"$f":"IF(I7=\"\",\"\",IF(MAXA(J7:L7)<=0,0,MAXA(J7:L7)))","v":50},-68,70,-74,{"$f":"IF(I7=\"\",\"\",IF(MAXA(N7:P7)<=0,0,MAXA(N7:P7)))","v":70},{"$f":"IF(I7=\"\",\"\",IF(OR(M7=0,Q7=0),0,M7+Q7))","v":120},{"$f":"IF(I7=\"\",\"\",IF(A7=\"H\",10^(0.794358141*LOG(I7/174.393)^2)*R7,IF(A7=\"F\",10^(0.89726074*LOG(I7/148.026)^2)*R7,\"\")))","v":157.3419101463457},{"$f":"RANK(S7,S6:S12)","v":6},{"$f":"IF(I7=\"\",\"\",IF(AE7>=0,AE7,IF(AD7>=0,AD7,IF(AC7>=0,AC7,IF(AB7>=0,AB7,IF(AA7>=0,AA7,IF(Z7>=0,Z7,IF(Y7>=0,Y7,X7))))))))","v":0},"FJ69",{"$f":"SUM(R7-(I7*2))","v":-8.5999999999999943},{"$f":"R7-HLOOKUP(V7,Feuil1!$C$1:$AU$9,2,FALSE)","v":45},{"$f":"R7-HLOOKUP(V7,Feuil1!$C$1:$AU$9,3,FALSE)","v":35},{"$f":"R7-HLOOKUP(V7,Feuil1!$C$1:$AU$9,4,FALSE)","v":20},{"$f":"R7-HLOOKUP(V7,Feuil1!$C$1:$AU$9,5,FALSE)","v":0},{"$f":"R7-HLOOKUP(V7,Feuil1!$C$1:$AU$9,6,FALSE)","v":-15},{"$f":"R7-HLOOKUP(V7,Feuil1!$C$1:$AU$9,7,FALSE)","v":-30},{"$f":"R7-HLOOKUP(V7,Feuil1!$C$1:$AU$9,8,FALSE)","v":-45},{"$f":"R7-HLOOKUP(V7,Feuil1!$C$1:$AU$9,9,FALSE)","v":-880},null,null,null,null,null,null,null,{"$f":"IF(AE7>=0,$AE$4,IF(AD7>=0,$AD$4,IF(AC7>=0,$AC$4,IF(AB7>=0,$AB$4,IF(AA7>=0,$AA$4,IF(Z7>=0,$Z$4,IF(Y7>=0,$Y$4,IF(X7>=0,$X$4,$AF$4))))))))","v":"FED +"}]
["F",null,null,null,"MONTERO","Cristina","Espagne",99,47.55,50,52,54,{"$f":"IF(I8=\"\",\"\",IF(MAXA(J8:L8)<=0,0,MAXA(J8:L8)))","v":54},60,63,65,{"$f":"IF(I8=\"\",\"\",IF(MAXA(N8:P8)<=0,0,MAXA(N8:P8)))","v":65},{"$f":"IF(I8=\"\",\"\",IF(OR(M8=0,Q8=0),0,M8+Q8))","v":119},{"$f":"IF(I8=\"\",\"\",IF(A8=\"H\",10^(0.794358141*LOG(I8/174.393)^2)*R8,IF(A8=\"F\",10^(0.89726074*LOG(I8/148.026)^2)*R8,\"\")))","v":196.69403248818205},{"$f":"RANK(S8,S6:S12)","v":4},null,"FJ48",null,{"$f":"R8-HLOOKUP(#REF!,Feuil1!$C$1:$AU$9,2,FALSE)","v":{"$error":"#REF!"}},{"$f":"R8-HLOOKUP(#REF!,Feuil1!$C$1:$AU$9,3,FALSE)","v":{"$error":"#REF!"}},{"$f":"R8-HLOOKUP(#REF!,Feuil1!$C$1:$AU$9,4,FALSE)","v":{"$error":"#REF!"}},{"$f":"R8-HLOOKUP(#REF!,Feuil1!$C$1:$AU$9,5,FALSE)","v":{"$error":"#REF!"}},{"$f":"R8-HLOOKUP(#REF!,Feuil1!$C$1:$AU$9,6,FALSE)","v":{"$error":"#REF!"}},{"$f":"R8-HLOOKUP(#REF!,Feuil1!$C$1:$AU$9,7,FALSE)","v":{"$error":"#REF!"}},{"$f":"R8-HLOOKUP(#REF!,Feuil1!$C$1:$AU$9,8,FALSE)","v":{"$error":"#REF!"}},{"$f":"R8-HLOOKUP(#REF!,Feuil1!$C$1:$AU$9,9,FALSE)","v":{"$error":"#REF!"}},null,null,null,null,null,null,null,{"$f":"IF(AE8>=0,$AE$4,IF(AD8>=0,$AD$4,IF(AC8>=0,$AC$4,IF(AB8>=0,$AB$4,IF(AA8>=0,$AA$4,IF(Z8>=0,$Z$4,IF(Y8>=0,$Y$4,IF(X8>=0,$X$4,$AF$4))))))))","v":{"$error":"#REF!"}}]
["F",null,null,null,"PASCUAL","Rafaela","Espagne",98,85.25,75,80,82,{"$f":"IF(I9=\"\",\"\",IF(MAXA(J9:L9)<=0,0,MAXA(J9:L9)))","v":82},98,-101,101,{"$f":"IF(I9=\"\",\"\",IF(MAXA(N9:P9)<=0,0,MAXA(N9:P9)))","v":101},{"$f":"IF(I9=\"\",\"\",IF(OR(M9=0,Q9=0),0,M9+Q9))","v":183},{"$f":"IF(I9=\"\",\"\",IF(A9=\"H\",10^(0.794358141*LOG(I9/174.393)^2)*R9,IF(A9=\"F\",10^(0.89726074*LOG(I9/148.026)^2)*R9,\"\")))","v":206.05347021474398},{"$f":"RANK(S9,S6:S12)","v":3},null,"FJ+75",null,{"$f":"R9-HLOOKUP(#REF!,Feuil1!$C$1:$AU$9,2,FALSE)","v":{"$error":"#REF!"}},{"$f":"R9-HLOOKUP(#REF!,Feuil1!$C$1:$AU$9,3,FALSE)","v":{"$error":"#REF!"}},{"$f":"R9-HLOOKUP(#REF!,Feuil1!$C$1:$AU$9,4,FALSE)","v":{"$error":"#REF!"}},{"$f":"R9-HLOOKUP(#REF!,Feuil1!$C$1:$AU$9,5,FALSE)","v":{"$error":"#REF!"}},{"$f":"R9-HLOOKUP(#REF!,Feuil1!$C$1:$AU$9,6,FALSE)","v":{"$error":"#REF!"}},{"$f":"R9-HLOOKUP(#REF!,Feuil1!$C$1:$AU$9,7,FALSE)","v":{"$error":"#REF!"}},{"$f":"R9-HLOOKUP(#REF!,Feuil1!$C$1:$AU$9,8,FALSE)","v":{"$error":"#REF!"}},{"$f":"R9-HLOOKUP(#REF!,Feuil1!$C$1:$AU$9,9,FALSE)","v":{"$error":"#REF!"}},null,null,null,null,null,null,null,{"$f":"IF(AE9>=0,$AE$4,IF(AD9>=0,$AD$4,IF(AC9>=0,$AC$4,IF(AB9>=0,$AB$4,IF(AA9>=0,$AA$4,IF(Z9>=0,$Z$4,IF(Y9>=0,$Y$4,IF(X9>=0,$X$4,$AF$4))))))))","v":{"$error":"#REF!"}}]
["F",null,null,null,"SERMENGHI","Irène","Italie",99,58.85,50,-55,-56,{"$f":"IF(I10=\"\",\"\",IF(MAXA(J10:L10)<=0,0,MAXA(J10:L10)))","v":50},58,62,-68,{"$f":"IF(I10=\"\",\"\",IF(MAXA(N10:P10)<=0,0,MAXA(N10:P10)))","v":62},{"$f":"IF(I10=\"\",\"\",IF(OR(M10=0,Q10=0),0,M10+Q10))","v":112},{"$f":"IF(I10=\"\",\"\",IF(A10=\"H\",10^(0.794358141*LOG(I10/174.393)^2)*R10,IF(A10=\"F\",10^(0.89726074*LOG(I10/148.026)^2)*R10,\"\")))","v":156.02876285665337},{"$f":"RANK(S10,S6:S12)","v":7},{"$f":"IF(I10=\"\",\"\",IF(AE10>=0,AE10,IF(AD10>=0,AD10,IF(AC10>=0,AC10,IF(AB10>=0,AB10,IF(AA10>=0,AA10,IF(Z10>=0,Z10,IF(Y10>=0,Y10,X10))))))))","v":2},"FJ63",{"$f":"SUM(R10-(I10*2))","v":-5.7000000000000028},{"$f":"R10-HLOOKUP(V10,Feuil1!$C$1:$AU$9,2,FALSE)","v":42},{"$f":"R10-HLOOKUP(V10,Feuil1!$C$1:$AU$9,3,FALSE)","v":32},{"$f":"R10-HLOOKUP(V10,Feuil1!$C$1:$AU$9,4,FALSE)","v":17},{"$f":"R10-HLOOKUP(V10,Feuil1!$C$1:$AU$9,5,FALSE)","v":2},{"$f":"R10-HLOOKUP(V10,Feuil1!$C$1:$AU$9,6,FALSE)","v":-13},{"$f":"R10-HLOOKUP(V10,Feuil1!$C$1:$AU$9,7,FALSE)","v":-28},{"$f":"R10-HLOOKUP(V10,Feuil1!$C$1:$AU$9,8,FALSE)","v":-43},{"$f":"R10-HLOOKUP(V10,Feuil1!$C$1:$AU$9,9,FALSE)","v":-888},null,null,null,null,null,null,null,{"$f":"IF(AE10>=0,$AE$4,IF(AD10>=0,$AD$4,IF(AC10>=0,$AC$4,IF(AB10>=0,$AB$4,IF(AA10>=0,$AA$4,IF(Z10>=0,$Z$4,IF(Y10>=0,$Y$4,IF(X10>=0,$X$4,$AF$4))))))))","v":"FED +"}]
["F",null,null,null,"ELPASO","Sophie","ALSDD Toulon",98,68.400000000000006,55,58,60,{"$f":"IF(I11=\"\",\"\",IF(MAXA(J11:L11)<=0,0,MAXA(J11:L11)))","v":60},72,75,78,78,138,174.07792999891311,{"$f":"RANK(S11,S6:S12)","v":5},3,"FJ69",{"$f":"SUM(R11-(I11*2))","v":1.1999999999999886},{"$f":"R11-HLOOKUP(V11,Feuil1!$C$1:$AU$9,2,FALSE)","v":63},{"$f":"R11-HLOOKUP(V11,Feuil1!$C$1:$AU$9,3,FALSE)","v":53},{"$f":"R11-HLOOKUP(V11,Feuil1!$C$1:$AU$9,4,FALSE)","v":38},{"$f":"R11-HLOOKUP(V11,Feuil1!$C$1:$AU$9,5,FALSE)","v":18},{"$f":"R11-HLOOKUP(V11,Feuil1!$C$1:$AU$9,6,FALSE)","v":3},{"$f":"R11-HLOOKUP(V11,Feuil1!$C$1:$AU$9,7,FALSE)","v":-12},{"$f":"R11-HLOOKUP(V11,Feuil1!$C$1:$AU$9,8,FALSE)","v":-27},{"$f":"R11-HLOOKUP(V11,Feuil1!$C$1:$AU$9,9,FALSE)","v":-862},null,null,null,null,null,null,null,"NAT +"]
["F",null,null,null,"DUMARAIS","Mélissa","Caen CHM",92,61,68,-72,72,72,85,90,92,92,164,222.76449106708586,{"$f":"RANK(S12,S6:S12)","v":2},24,{"$f":"IF(I12=\"\",\"\",IF(A12=\"H\",IF(OR(H12=\"SEN\",H12<94),VLOOKUP(I12,Feuil1!$A$10:$E$28,5),IF(AND(H12>93,H12<97),VLOOKUP(I12,Feuil1!$A$10:$E$28,4),IF(AND(H12>93,H12<96),VLOOKUP(I12,Feuil1!$A$10:$E$28,3),IF(AND(H12>95,H12<2000),VLOOKUP(I12,Feuil1!$A$10:$E$28,3),VLOOKUP(I12,Feuil1!$A$10:$E$28,2))))),IF(OR(H12=\"SEN\",H12<94),VLOOKUP(I12,Feuil1!$F$10:$J$24,5),IF(AND(H12>93,H12<97),VLOOKUP(I12,Feuil1!$F$10:$J$24,4),IF(AND(H12>93,H12<96),VLOOKUP(I12,Feuil1!$F$10:$J$24,4),IF(AND(H12>93,H12<2000),VLOOKUP(I12,Feuil1!$F$10:$J$24,3),VLOOKUP(I12,Feuil1!$F$10:$J$24,2)))))))","v":"FS63"},{"$f":"SUM(R12-(I12*2))","v":42},{"$f":"R12-HLOOKUP(V12,Feuil1!$C$1:$AU$9,2,FALSE)","v":79},{"$f":"R12-HLOOKUP(V12,Feuil1!$C$1:$AU$9,3,FALSE)","v":69},{"$f":"R12-HLOOKUP(V12,Feuil1!$C$1:$AU$9,4,FALSE)","v":54},{"$f":"R12-HLOOKUP(V12,Feuil1!$C$1:$AU$9,5,FALSE)","v":39},{"$f":"R12-HLOOKUP(V12,Feuil1!$C$1:$AU$9,6,FALSE)","v":24},{"$f":"R12-HLOOKUP(V12,Feuil1!$C$1:$AU$9,7,FALSE)","v":-1},{"$f":"R12-HLOOKUP(V12,Feuil1!$C$1:$AU$9,8,FALSE)","v":-21},{"$f":"R12-HLOOKUP(V12,Feuil1!$C$1:$AU$9,9,FALSE)","v":-36},null,null,null,null,null,null,null,"NAT +"]
[null,null,null,null,null,null,null,null,null,null," "," "]
[null,null,null,null,"Secrétaire de Compétition",null,"Arbitre",null,null,null,null,null,null,"Arbitre",null," ",null,null,null,"Arbitre"]
[null,null,null,"Nom :",null,"Nom :",null,null," ",null,null,"Nom :",null,null,null,null,null,"Nom :"]
[null,null,null,"Signature :"," ","Signature :",null,null," ",null,null,"Signature :"," ",null,null,null,null,"Signature :"]
[]
[null,null,null,null,null,null,null,null,null,null," "," "]
[]
[]
[]
[]
[]
[]
[]
[]
[]
[]
[]
[]
[]
[]
[]
[]
[]
[]
[]
[]
[]
[]
[]
[]
[]
[]
[]
[]
[]
[]
[]
[]
[]
[]
[]
[]
[]
[]
[]
[]
[]
[]
[]
[]
[]
[]
[]
[]
[]
[]
[]
[]
[]
[]
[]
[]
[]
[]
[]
[]
[]
[]
[]
[]
[]
[]
[]
[]
[]
[]
[]
[]
[]
[]
[]
[]
[]
[]
[]
[]
[]
[]
[]
[]
[]
[]
[]
[]
[]
[]
[]
[]
[]
[]
[]
[]
[]
[]
[]
[]
[]
[]
[]
[]
[]
[]
[]
[]
[]
[]
[]
[]
[]
[]
[]
[]
[]
[]
[]
[]
[]
[]
[]
[]
[]
[]
[]
[]
[]
[]
[]
[]
[]
[]
[]
[]
[]
[]
[]
[]
[]
[]
[]
[]
[]
[]
[]
[]
[]
[]
[]
[]
[]
[]
[]
[]
[]
[]
[]
[]
[]
[]
[]
[]
[]
[]
[]
[]
[]
[]
[]
[]
[]
[]
[]
[]
[]
[]
[]
[]
[]
[]
[]
[]
[]
[]
[]
[]
[]
[]
[]
[]
[]
[]
[]
[]
[]
[]
[]
[]
[]
[]
[]
[]
[]
[]
[]
[]
[]
[]
[]
[]
[]
[]
[]
[]
[]
[]
[]
[]
[]
[]
[]
[]
[]
[]
[]
[]
[]
[]
[]
[]
[]
[]
[]
[]
[]
[]
[]
[]
[]
[]
[]
[]
[]
[]
[]
[]
[]
[]
[]
[]
[]
[]
[]
[]
[]
[]
[]
[]
[]
[]
[]
[]
[]
[]
[]
[]
[]
[]
[]
[]
[]
[]
[]
[]
[]
[]
[]
[]
[]
[]
[]
[]
[]
[]
[]
[]
[]
[]
[]
[]
[]
[]
[]
[]
[]
[]
[]
[]
[]
[]
[]
[]
[]
[]
[]
[]
[]
[]
[]
[]
[]
[]
[]
[]
[]
[]
[]
[]
[]
[]
[]
[]
[]
[]
[]
[]
[]
[]
[]
[]
[]
[]
[]
[]
[]
[]
[]
[]
[]
[]
[]
[]
[]
[]
[]
[]
[]
[]
[]
[]
[]
[]
[]
[]
[]
[]
[]
[]
[]
[]
[]
[]
[]
[]
[]
[]
[]
[]
[]
[]
[]
[]
[]
[]
[]
[]
[]
[]
[]
[]
{"$rows_left_out":127}
{"sheet":"Feuil1","index":1,"n_rows":28,"n_cols":47,"rows_kept":28,"cut":false,"hidden":true,"merged":[]}
[null,null,"FC44","FC48","FC53","FC58","FC63","FC69","FC+69","FJ48","FJ53","FJ58","FJ63","FJ69","FJ75","FJ+75","FS48","FS53","FS58","FS63","FS69","FS75","FS+75","C50","C56","C62","C69","C77","C85","C94","C+94","J56","J62","J69","J77","J85","J94","J105","J+105","S56","S62","S69","S77","S85","S94","S105","S+105"]
[null,"DEPARTEMENTAL",40,45,50,55,60,65,75,50,55,65,70,75,90,100,60,70,80,85,95,100,110,65,80,100,115,125,135,150,160,95,110,125,140,155,165,175,185,110,130,145,160,175,185,195,205]
[null,"REGIONAL",50,55,65,70,75,80,90,60,65,75,80,85,100,110,70,80,90,95,105,115,125,80,95,115,130,145,155,170,180,110,130,145,160,175,185,195,205,130,150,165,180,195,205,215,225]
[null,"INTERREGIONAL",60,65,75,80,85,95,105,75,80,90,95,100,115,120,85,95,100,110,120,130,140,95,110,130,150,165,180,190,205,130,150,165,185,195,205,215,225,145,170,185,205,220,230,240,250]
[null,"FEDERAL",70,75,85,90,95,105,115,85,95,100,110,120,130,140,95,105,115,125,135,145,155,110,125,145,160,180,195,210,220,145,165,185,205,220,230,240,250,170,195,215,235,250,260,270,280]
[null,"NATIONAL",80,85,95,100,110,120,130,95,105,110,125,135,145,155,110,120,130,140,150,160,170,120,140,160,175,195,215,225,235,170,190,215,235,250,260,270,280,195,220,240,265,280,290,300,310]
[null,"INTERNATIONAL B",90,95,105,115,125,135,145,110,120,130,140,150,160,170,125,140,155,165,175,180,190,135,155,175,190,210,230,240,250,190,215,240,270,280,290,305,315,210,240,260,290,310,320,330,340]
[null,"INTERNATIONAL A",100,105,115,125,135,145,155,125,135,145,155,165,175,185,140,160,175,185,190,195,210,150,175,195,215,235,250,260,270,215,235,260,280,300,310,320,330,225,255,275,310,330,340,350,360]
[null,"OLYMPIQUE",1000,1000,1000,1000,1000,1000,1000,1000,1000,1000,1000,1000,1000,10000,155,175,190,200,205,210,225,1000,1000,1000,1000,1000,10000,1000,1000,1000,1000,1000,10000,1000,1000,1000,10000,240,270,290,325,345,355,365,375]
[null,"MINIME","CADET","JUNIOR","SENIOR",null,"MINIME","CADETTE","JUNIOR","SENIOR"]
[20.010000000000002,"NON","C50","J56","S56",20.010000000000002,"NON","FC44","FJ48","FS48"]
[34.01,"NON","C50","J56","S56",30.01,"NON","FC44","FJ48","FS48"]
[38.01,"NON","C50","J56","S56",35.01,"NON","FC44","FJ48","FS48"]
[40.01,"NON","C50","J56","S56",36.01,"NON","FC44","FJ48","FS48"]
[45.01,"NON","C50","J56","S56",40.01,"NON","FC44","FJ48","FS48"]
[50.01,"NON","C56","J56","S56",44.01,"NON","FC48","FJ48","FS48"]
[52.05,"NON","C56","J56","S56",48.01,"NON","FC53","FJ53","FS53"]
[56.01,"NON","C62","J62","S62",53.01,"NON","FC58","FJ58","FS58"]
[62.01,"NON","C69","J69","S69",58.01,"NON","FC63","FJ63","FS63"]
[69.010000000000005,"NON","C77","J77","S77",63.01,"NON","FC69","FJ69","FS69"]
[77.010000000000005,"NON","C85","J85","S85",69.010000000000005,"NON","FC+69","FJ75","FS75"]
[85.01,"NON","C94","J94","S94",75.010000000000005,"NON","FC+69","FJ+75","FS+75"]
[94.01,"NON","C+94","J105","S105",110,"NON","FC+69","FJ+75","FS+75"]
[105.01,"NON","C+94","J+105","S+105",140,"NON","FC+69","FJ+75","FS+75"]
[110,"NON","C+94","J+105","S+105"]
[120,"NON","C+94","J+105","S+105"]
[130,"NON","C+94","J+105","S+105"]
[140,"NON","C+94","J+105","S+105"]

{"sheet":"Feuil2","index":2,"n_rows":0,"n_cols":0,"rows_kept":0,"cut":false,"hidden":false,"merged":[]}